Se connecter / S'enregistrer
Votre question

Installation de ndiswrapper problématique

Tags :
  • Système d'exploitation
Dernière réponse : dans Systèmes d'exploitation
21 Septembre 2007 18:42:15

Bonjour!
Je suis sous Kubuntu, la dernière version.
J'ai téléchargé la version 1.48 de ndiswrapper.
J'ai décompressé le dossier.
Maintenant, je souhaite le compiler etc. pour l'installer en somme.
Pour cela voici ce que j'ai fait et ce qu'on me dit:

Citation :
chamaille@ubuntu:~/Configuration de l'ordinateur/ndiswrapper-1.48$ make
make -C driver
make[1]: entrant dans le répertoire « /home/chamaille/Configuration de l'ordinateur/ndiswrapper-1.48/driver »
make -C /usr/src/linux-headers-2.6.20-15-generic SUBDIRS=/home/chamaille/Configuration de l'ordinateur/ndiswrapper-1.48/driver
/bin/sh: Syntax error: Unterminated quoted string
make[1]: *** [default] Erreur 2
make[1]: quittant le répertoire « /home/chamaille/Configuration de l'ordinateur/ndiswrapper-1.48/driver »
make: *** [all] Erreur 2
chamaille@ubuntu:~/Configuration de l'ordinateur/ndiswrapper-1.48$


Je n'ai aucune idée de quoi faire... J'espère que vous pourrez m'aider!!! :D 
Merci beaucoup d'avance!

PS: je ne suis pas connecté à internet via cet ordinateur! Je ne peux donc pas télécharger directement (via la console etc.) ndiswrapper... Je ne peux pas non plus utiliser de cd etc... sur lesquel pourrait y avoir ndiswrapper.

Autres pages sur : installation ndiswrapper problematique

21 Septembre 2007 20:32:13

Bonjour,
n'y a-t-il pas un fichier de doc dans l'archive que tu as téléchargé.
Sinon, la marche à suivre est en général de se placer dans le répertoire où l'archhive a été décompressée, puis de faire
./configure
make
make install (ou mieux checkinstall si tu as ce paquest d'installlé).
@+
21 Septembre 2007 20:33:41

Finalement c'était une question d'espace dans le nom de mon dossier...
Maintenant que cette erreur est corrigée, cela ne marche toujours pas:

Citation :
chamaille@ubuntu:~$ cd /home/chamaille/Configuration/ndiswrapper-1.48
chamaille@ubuntu:~/Configuration/ndiswrapper-1.48$ make
make -C driver
make[1]: entrant dans le répertoire « /home/chamaille/Configuration/ndiswrapper-
1.48/driver »
make -C /usr/src/linux-headers-2.6.20-15-generic SUBDIRS=/home/chamaille/Configu
ration/ndiswrapper-1.48/driver
make[2]: entrant dans le répertoire « /usr/src/linux-headers-2.6.20-15-generic »
LD /home/chamaille/Configuration/ndiswrapper-1.48/driver/built-in.o
CC [M] /home/chamaille/Configuration/ndiswrapper-1.48/driver/crt.o
CC [M] /home/chamaille/Configuration/ndiswrapper-1.48/driver/hal.o
CC [M] /home/chamaille/Configuration/ndiswrapper-1.48/driver/iw_ndis.o
CC [M] /home/chamaille/Configuration/ndiswrapper-1.48/driver/loader.o
CC [M] /home/chamaille/Configuration/ndiswrapper-1.48/driver/ndis.o
CC [M] /home/chamaille/Configuration/ndiswrapper-1.48/driver/ntoskernel.o
CC [M] /home/chamaille/Configuration/ndiswrapper-1.48/driver/ntoskernel_io.o
CC [M] /home/chamaille/Configuration/ndiswrapper-1.48/driver/pe_linker.o
CC [M] /home/chamaille/Configuration/ndiswrapper-1.48/driver/pnp.o
CC [M] /home/chamaille/Configuration/ndiswrapper-1.48/driver/proc.o
CC [M] /home/chamaille/Configuration/ndiswrapper-1.48/driver/rtl.o
CC [M] /home/chamaille/Configuration/ndiswrapper-1.48/driver/wrapmem.o
CC [M] /home/chamaille/Configuration/ndiswrapper-1.48/driver/wrapndis.o
CC [M] /home/chamaille/Configuration/ndiswrapper-1.48/driver/wrapper.o
CC [M] /home/chamaille/Configuration/ndiswrapper-1.48/driver/usb.o
CC [M] /home/chamaille/Configuration/ndiswrapper-1.48/driver/divdi3.o
LD [M] /home/chamaille/Configuration/ndiswrapper-1.48/driver/ndiswrapper.o
Building modules, stage 2.
MODPOST 1 modules
CC /home/chamaille/Configuration/ndiswrapper-1.48/driver/ndiswrapper.mod.
o
LD [M] /home/chamaille/Configuration/ndiswrapper-1.48/driver/ndiswrapper.ko
make[2]: quittant le répertoire « /usr/src/linux-headers-2.6.20-15-generic »
make[1]: quittant le répertoire « /home/chamaille/Configuration/ndiswrapper-1.48
/driver »
make -C utils
make[1]: entrant dans le répertoire « /home/chamaille/Configuration/ndiswrapper-
1.48/utils »
gcc -g -Wall -I../driver -o loadndisdriver loadndisdriver.c
loadndisdriver.c:15:20: erreur: stdlib.h : Aucun fichier ou répertoire de ce typ
e
loadndisdriver.c:16:19: erreur: stdio.h : Aucun fichier ou répertoire de ce type
loadndisdriver.c:17:19: erreur: errno.h : Aucun fichier ou répertoire de ce type
loadndisdriver.c:18:20: erreur: string.h : Aucun fichier ou répertoire de ce typ
e
loadndisdriver.c:19:20: erreur: libgen.h : Aucun fichier ou répertoire de ce typ
e
loadndisdriver.c:21:22: erreur: sys/mman.h : Aucun fichier ou répertoire de ce t
ype
loadndisdriver.c:23:23: erreur: sys/types.h : Aucun fichier ou répertoire de ce
type
loadndisdriver.c:24:23: erreur: sys/ioctl.h : Aucun fichier ou répertoire de ce
type
loadndisdriver.c:25:22: erreur: sys/stat.h : Aucun fichier ou répertoire de ce t
ype
loadndisdriver.c:26:20: erreur: unistd.h : Aucun fichier ou répertoire de ce typ
e
loadndisdriver.c:27:19: erreur: fcntl.h : Aucun fichier ou répertoire de ce type
Dans le fichier inclus à partir de /usr/lib/gcc/i486-linux-gnu/4.1.2/include/sys
limits.h:7,
à partir de /usr/lib/gcc/i486-linux-gnu/4.1.2/include/limits.h:11,
à partir de loadndisdriver.c:28:
/usr/lib/gcc/i486-linux-gnu/4.1.2/include/limits.h:122:61: erreur: limits.h : Au
cun fichier ou répertoire de ce type
loadndisdriver.c:29:19: erreur: ctype.h : Aucun fichier ou répertoire de ce type
loadndisdriver.c:30:20: erreur: dirent.h : Aucun fichier ou répertoire de ce typ
e
loadndisdriver.c:31:20: erreur: syslog.h : Aucun fichier ou répertoire de ce typ
e
loadndisdriver.c:34:25: erreur: linux/major.h : Aucun fichier ou répertoire de c
e type
loadndisdriver.c:35:25: erreur: linux/ioctl.h : Aucun fichier ou répertoire de c
e type
In file included from loadndisdriver.c:37:
../driver/loader.h:24: erreur: expected specifier-qualifier-list before ‘size_t’
loadndisdriver.c: In function ‘load_file’:
loadndisdriver.c:67: erreur: ‘size_t’ undeclared (first use in this function)
loadndisdriver.c:67: erreur: (Each undeclared identifier is reported only once
loadndisdriver.c:67: erreur: for each function it appears in.)
loadndisdriver.c:67: erreur: expected ‘;’ before ‘size’
loadndisdriver.c:68: erreur: ‘NULL’ undeclared (first use in this function)
loadndisdriver.c:69: erreur: storage size of ‘statbuf’ isn’t known
loadndisdriver.c:71: attention : implicit declaration of function ‘basename’
loadndisdriver.c:71: attention : initialization makes pointer from integer witho
ut a cast
loadndisdriver.c:73: attention : implicit declaration of function ‘open’
loadndisdriver.c:73: erreur: ‘O_RDONLY’ undeclared (first use in this function)
loadndisdriver.c:75: attention : implicit declaration of function ‘syslog’
loadndisdriver.c:75: erreur: ‘LOG_KERN’ undeclared (first use in this function)
loadndisdriver.c:75: erreur: ‘LOG_INFO’ undeclared (first use in this function)
loadndisdriver.c:75: attention : implicit declaration of function ‘strerror’
loadndisdriver.c:75: erreur: ‘errno’ undeclared (first use in this function)
loadndisdriver.c:76: erreur: ‘EINVAL’ undeclared (first use in this function)
loadndisdriver.c:79: attention : implicit declaration of function ‘fstat’
loadndisdriver.c:81: attention : implicit declaration of function ‘close’
loadndisdriver.c:84: erreur: ‘size’ undeclared (first use in this function)
loadndisdriver.c:86: attention : implicit declaration of function ‘mmap’
loadndisdriver.c:86: erreur: ‘PROT_READ’ undeclared (first use in this function)
loadndisdriver.c:86: erreur: ‘MAP_PRIVATE’ undeclared (first use in this functio
n)
loadndisdriver.c:86: attention : assignment makes pointer from integer without a
cast
loadndisdriver.c:87: erreur: ‘MAP_FAILED’ undeclared (first use in this function
)
loadndisdriver.c:93: attention : implicit declaration of function ‘strncpy’
loadndisdriver.c:93: attention : incompatible implicit declaration of built-in f
unction ‘strncpy’
loadndisdriver.c:95: erreur: ‘struct load_driver_file’ has no member named ‘size

loadndisdriver.c:96: erreur: ‘struct load_driver_file’ has no member named ‘data

loadndisdriver.c:69: attention : unused variable ‘statbuf’
loadndisdriver.c: In function ‘parse_setting_line’:
loadndisdriver.c:109: attention : implicit declaration of function ‘isspace’
loadndisdriver.c:115: attention : implicit declaration of function ‘strchr’
loadndisdriver.c:115: attention : incompatible implicit declaration of built-in
function ‘strchr’
loadndisdriver.c:115: erreur: ‘NULL’ undeclared (first use in this function)
loadndisdriver.c:117: erreur: ‘LOG_KERN’ undeclared (first use in this function)
loadndisdriver.c:117: erreur: ‘LOG_INFO’ undeclared (first use in this function)
loadndisdriver.c:118: erreur: ‘EINVAL’ undeclared (first use in this function)
loadndisdriver.c:138: attention : implicit declaration of function ‘strlen’
loadndisdriver.c:138: attention : incompatible implicit declaration of built-in
function ‘strlen’
loadndisdriver.c: In function ‘read_conf_file’:
loadndisdriver.c:150: erreur: storage size of ‘statbuf’ isn’t known
loadndisdriver.c:151: erreur: ‘FILE’ undeclared (first use in this function)
loadndisdriver.c:151: erreur: ‘config’ undeclared (first use in this function)
loadndisdriver.c:157: attention : implicit declaration of function ‘lstat’
loadndisdriver.c:158: erreur: ‘LOG_KERN’ undeclared (first use in this function)
loadndisdriver.c:158: erreur: ‘LOG_INFO’ undeclared (first use in this function)
loadndisdriver.c:158: erreur: ‘errno’ undeclared (first use in this function)
loadndisdriver.c:160: erreur: ‘EINVAL’ undeclared (first use in this function)
loadndisdriver.c:163: attention : implicit declaration of function ‘sscanf’
loadndisdriver.c:163: attention : incompatible implicit declaration of built-in
function ‘sscanf’
loadndisdriver.c:178: attention : implicit declaration of function ‘fopen’
loadndisdriver.c:178: erreur: ‘NULL’ undeclared (first use in this function)
loadndisdriver.c:182: attention : implicit declaration of function ‘fgets’
loadndisdriver.c:194: attention : incompatible implicit declaration of built-in
function ‘strncpy’
loadndisdriver.c:205: attention : implicit declaration of function ‘fclose’
loadndisdriver.c:150: attention : unused variable ‘statbuf’
loadndisdriver.c: In function ‘load_bin_file’:
loadndisdriver.c:217: erreur: ‘LOG_KERN’ undeclared (first use in this function)
loadndisdriver.c:217: erreur: ‘LOG_INFO’ undeclared (first use in this function)
loadndisdriver.c:219: attention : implicit declaration of function ‘tolower’
loadndisdriver.c:221: attention : implicit declaration of function ‘chdir’
loadndisdriver.c:222: erreur: ‘errno’ undeclared (first use in this function)
loadndisdriver.c:224: erreur: ‘EINVAL’ undeclared (first use in this function)
loadndisdriver.c:230: attention : incompatible implicit declaration of built-in
function ‘strncpy’
loadndisdriver.c:232: attention : implicit declaration of function ‘ioctl’
loadndisdriver.c:232: attention : implicit declaration of function ‘_IOW’
loadndisdriver.c:232: erreur: expected expression before ‘struct’
loadndisdriver.c: In function ‘load_driver’:
loadndisdriver.c:249: erreur: ‘DIR’ undeclared (first use in this function)
loadndisdriver.c:249: erreur: ‘driver_dir’ undeclared (first use in this functio
n)
loadndisdriver.c:251: erreur: ‘NULL’ undeclared (first use in this function)
loadndisdriver.c:255: erreur: ‘LOG_KERN’ undeclared (first use in this function)
loadndisdriver.c:255: erreur: ‘LOG_INFO’ undeclared (first use in this function)
loadndisdriver.c:257: erreur: ‘errno’ undeclared (first use in this function)
loadndisdriver.c:259: erreur: ‘EINVAL’ undeclared (first use in this function)
loadndisdriver.c:261: attention : implicit declaration of function ‘opendir’
loadndisdriver.c:267: attention : implicit declaration of function ‘malloc’
loadndisdriver.c:267: attention : incompatible implicit declaration of built-in
function ‘malloc’
loadndisdriver.c:271: attention : implicit declaration of function ‘memset’
loadndisdriver.c:271: attention : incompatible implicit declaration of built-in
function ‘memset’
loadndisdriver.c:272: attention : incompatible implicit declaration of built-in
function ‘strncpy’
loadndisdriver.c:280: attention : implicit declaration of function ‘readdir’
loadndisdriver.c:280: attention : assignment makes pointer from integer without
a cast
loadndisdriver.c:282: erreur: storage size of ‘statbuf’ isn’t known
loadndisdriver.c:284: erreur: déréférencement d'un pointeur de type incomplet
loadndisdriver.c:287: attention : implicit declaration of function ‘stat’
loadndisdriver.c:287: erreur: déréférencement d'un pointeur de type incomplet
loadndisdriver.c:288: attention : implicit declaration of function ‘S_ISREG’
loadndisdriver.c:289: erreur: déréférencement d'un pointeur de type incomplet
loadndisdriver.c:294: attention : incompatible implicit declaration of built-in
function ‘strlen’
loadndisdriver.c:294: erreur: déréférencement d'un pointeur de type incomplet
loadndisdriver.c:296: attention : implicit declaration of function ‘strcasecmp’
loadndisdriver.c:296: erreur: déréférencement d'un pointeur de type incomplet
loadndisdriver.c:299: erreur: déréférencement d'un pointeur de type incomplet
loadndisdriver.c:302: erreur: déréférencement d'un pointeur de type incomplet
loadndisdriver.c:303: erreur: déréférencement d'un pointeur de type incomplet
loadndisdriver.c:305: erreur: déréférencement d'un pointeur de type incomplet
loadndisdriver.c:311: erreur: déréférencement d'un pointeur de type incomplet
loadndisdriver.c:312: erreur: déréférencement d'un pointeur de type incomplet
loadndisdriver.c:313: attention : implicit declaration of function ‘strcpy’
loadndisdriver.c:313: attention : incompatible implicit declaration of built-in
function ‘strcpy’
loadndisdriver.c:314: erreur: déréférencement d'un pointeur de type incomplet
loadndisdriver.c:317: erreur: ‘struct load_driver_file’ has no member named ‘siz
e’
loadndisdriver.c:318: erreur: ‘struct load_driver_file’ has no member named ‘dat
a’
loadndisdriver.c:321: erreur: déréférencement d'un pointeur de type incomplet
loadndisdriver.c:282: attention : unused variable ‘statbuf’
loadndisdriver.c:344: erreur: expected expression before ‘struct’
loadndisdriver.c:346: attention : implicit declaration of function ‘closedir’
loadndisdriver.c:348: attention : implicit declaration of function ‘free’
loadndisdriver.c:355: attention : implicit declaration of function ‘munmap’
loadndisdriver.c:355: erreur: ‘struct load_driver_file’ has no member named ‘dat
a’
loadndisdriver.c:355: erreur: ‘struct load_driver_file’ has no member named ‘siz
e’
loadndisdriver.c:357: erreur: ‘struct load_driver_file’ has no member named ‘dat
a’
loadndisdriver.c:357: erreur: ‘struct load_driver_file’ has no member named ‘siz
e’
loadndisdriver.c: In function ‘get_device’:
loadndisdriver.c:367: erreur: storage size of ‘statbuf’ isn’t known
loadndisdriver.c:370: erreur: ‘LOG_KERN’ undeclared (first use in this function)
loadndisdriver.c:370: erreur: ‘LOG_INFO’ undeclared (first use in this function)
loadndisdriver.c:373: erreur: ‘errno’ undeclared (first use in this function)
loadndisdriver.c:374: erreur: ‘EINVAL’ undeclared (first use in this function)
loadndisdriver.c:376: attention : implicit declaration of function ‘snprintf’
loadndisdriver.c:376: attention : incompatible implicit declaration of built-in
function ‘snprintf’
loadndisdriver.c:407: attention : incompatible implicit declaration of built-in
function ‘strncpy’
loadndisdriver.c:367: attention : unused variable ‘statbuf’
loadndisdriver.c: In function ‘load_device’:
loadndisdriver.c:419: erreur: ‘DIR’ undeclared (first use in this function)
loadndisdriver.c:419: erreur: ‘dir’ undeclared (first use in this function)
loadndisdriver.c:423: erreur: ‘LOG_KERN’ undeclared (first use in this function)
loadndisdriver.c:423: erreur: ‘LOG_INFO’ undeclared (first use in this function)
loadndisdriver.c:424: attention : incompatible implicit declaration of built-in
function ‘memset’
loadndisdriver.c:426: erreur: ‘errno’ undeclared (first use in this function)
loadndisdriver.c:427: erreur: ‘EINVAL’ undeclared (first use in this function)
loadndisdriver.c:429: erreur: ‘NULL’ undeclared (first use in this function)
loadndisdriver.c:434: attention : assignment makes pointer from integer without
a cast
loadndisdriver.c:435: erreur: déréférencement d'un pointeur de type incomplet
loadndisdriver.c:436: erreur: déréférencement d'un pointeur de type incomplet
loadndisdriver.c:439: erreur: déréférencement d'un pointeur de type incomplet
loadndisdriver.c:447: erreur: expected expression before ‘struct’
loadndisdriver.c: In function ‘get_ioctl_device’:
loadndisdriver.c:464: erreur: ‘FILE’ undeclared (first use in this function)
loadndisdriver.c:464: erreur: ‘proc_misc’ undeclared (first use in this function
)
loadndisdriver.c:472: attention : implicit declaration of function ‘strstr’
loadndisdriver.c:472: attention : incompatible implicit declaration of built-in
function ‘strstr’
loadndisdriver.c:473: attention : implicit declaration of function ‘strtol’
loadndisdriver.c:473: erreur: ‘NULL’ undeclared (first use in this function)
loadndisdriver.c:483: erreur: ‘LOG_KERN’ undeclared (first use in this function)
loadndisdriver.c:483: erreur: ‘LOG_INFO’ undeclared (first use in this function)
loadndisdriver.c:488: attention : implicit declaration of function ‘unlink’
loadndisdriver.c:489: attention : implicit declaration of function ‘mknod’
loadndisdriver.c:489: erreur: ‘S_IFCHR’ undeclared (first use in this function)
loadndisdriver.c:489: erreur: ‘MISC_MAJOR’ undeclared (first use in this functio
n)
loadndisdriver.c:490: erreur: ‘errno’ undeclared (first use in this function)
loadndisdriver.c:495: erreur: ‘O_RDONLY’ undeclared (first use in this function)
loadndisdriver.c: In function ‘main’:
loadndisdriver.c:511: attention : implicit declaration of function ‘openlog’
loadndisdriver.c:511: erreur: ‘LOG_PERROR’ undeclared (first use in this functio n)
loadndisdriver.c:511: erreur: ‘LOG_CONS’ undeclared (first use in this function)
loadndisdriver.c:511: erreur: ‘LOG_KERN’ undeclared (first use in this function)
loadndisdriver.c:511: erreur: ‘LOG_DEBUG’ undeclared (first use in this function )
loadndisdriver.c:513: erreur: ‘LOG_INFO’ undeclared (first use in this function)
loadndisdriver.c:515: attention : implicit declaration of function ‘strncmp’
loadndisdriver.c:517: attention : implicit declaration of function ‘printf’
loadndisdriver.c:517: attention : incompatible implicit declaration of built-in function ‘printf’
loadndisdriver.c:527: attention : implicit declaration of function ‘atoi’
loadndisdriver.c:542: attention : implicit declaration of function ‘atof’
loadndisdriver.c:549: attention : implicit declaration of function ‘strcmp’
loadndisdriver.c:556: attention : incompatible implicit declaration of built-in function ‘sscanf’
loadndisdriver.c:590: attention : implicit declaration of function ‘closelog’
make[1]: *** [loadndisdriver] Erreur 1
make[1]: quittant le répertoire « /home/chamaille/Configuration/ndiswrapper-1.48 /utils »
make: *** [all] Erreur 2


Ce charabia ne me parle pas trop... il me semble qu'il y a une histoire de librairies au début mais bon...

Qui peut m'aider??? :( 

Merci beaucoup d'avance!
Contenus similaires
21 Septembre 2007 20:36:30

pourquoi tu ne l'installes pas par les dépôts plutôt que de t'emmerder à compiler??? Oo
21 Septembre 2007 20:40:12

je ne l'installe pas par les dépôts? Oo
21 Septembre 2007 20:50:10

les dépôts... tu veux dire passer par internet directement (via la console etc.) pour télécharger et installer?
Le problème c'est que justement je n'ai pas accès à internet: j'ai besoin auparavant de ndiswrapper!
21 Septembre 2007 20:58:05

Tu peux pas bracher ton PC en ethernet le temps d'installer ndiswrapper?
21 Septembre 2007 23:27:43

non malheureusement
Tom's guide dans le monde
  • Allemagne
  • Italie
  • Irlande
  • Royaume Uni
  • Etats Unis
Suivre Tom's Guide
Inscrivez-vous à la Newsletter
  • ajouter à twitter
  • ajouter à facebook
  • ajouter un flux RSS